Course
type: Class
comment: Single structured sequence of one or more educational activities that aims to develop a prescribed set of competencies of learners.
description: Course is distinct from Program, which aggregates several courses.
term status: stable
change history: https://credreg.net/ctdl/termhistory/ceterms/Course/json
subclass of: LearningOpportunityProfile
subclass of: CreativeWork
equivalent class: Course
domain for: accreditedBy
domain for: accreditedIn
domain for: advancedStandingFrom
domain for: alternateName
domain for: approvedBy
domain for: approvedIn
domain for: approximateDateEffective
domain for: approximateExpirationDate
domain for: assesses
domain for: assessmentMethodDescription
domain for: assessmentMethodType
domain for: atLevel
domain for: audienceLevelType
domain for: audienceType
domain for: availabilityListing
domain for: availableAt
domain for: availableOnlineAt
domain for: classification
domain for: codedNotation
domain for: commonConditions
domain for: commonCosts
domain for: complaintProcess
domain for: contentDescription
domain for: coPrerequisite
domain for: corequisite
domain for: creditUnitTypeDescription
domain for: creditValue
domain for: ctid
domain for: dateEffective
domain for: deliveryType
domain for: deliveryTypeDescription
domain for: description
domain for: developmentProcess
domain for: entryCondition
domain for: estimatedCost
domain for: estimatedDuration
domain for: expirationDate
domain for: financialAssistance
domain for: hasOffering
domain for: hasPart
domain for: hasProxy
domain for: hasRegulatoryInformation
domain for: hasRubric
domain for: hasSupportService
domain for: identifier
domain for: inCatalog
domain for: industryType
domain for: inLanguage
domain for: instructionalProgramType
domain for: isAdvancedStandingFor
domain for: isMemberOf
domain for: isNonCredit
domain for: isPartOf
domain for: isPreparationFor
domain for: isRecommendedFor
domain for: isRegisteredApprenticeship
domain for: isRequiredFor
domain for: isSimilarTo
domain for: jurisdiction
domain for: keyword
domain for: learningMethodDescription
domain for: learningMethodType
domain for: lifeCycleStatusType
domain for: maintenanceProcess
domain for: name
domain for: objectOfAction
domain for: occupationType
domain for: offeredBy
domain for: offeredIn
domain for: offerFrequencyType
domain for: ownedBy